bcrypt.dll

Helfe beim Thema bcrypt.dll in Windows 10 Support um eine Lösung zu finden; Folgender Fehler bei starten von iTunes.exe: Die Ausführung des Codes kann nicht fortgesetzt werden, da bcrypt.dll nicht gefunden wurde. Durch eine... Dieses Thema im Forum "Windows 10 Support" wurde erstellt von lliechte, 20. September 2018.

  1. lliechte
    lliechte Gast

    bcrypt.dll


    Folgender Fehler bei starten von iTunes.exe:

    Die Ausführung des Codes kann nicht fortgesetzt werden, da bcrypt.dll nicht gefunden wurde. Durch eine Neuinstallation des Programms kann das Problem möglicherweise behoben werden.


    Habe im Netz keine passenden Infos zur Lösung des Problems gefunden. Kann mir jemand weiterhelfen?

    Danke

    C:\WINDOWS\system32>dir bcrypt.dll
    Datenträger in Laufwerk C: ist System
    Volumeseriennummer: 80EA-22DC
    Verzeichnis von C:\WINDOWS\system32
    08.06.2018 11:30 137.568 bcrypt.dll
    1 Datei(en), 137.568 Bytes
    0 Verzeichnis(se), 45.097.783.296 Bytes frei

    Weiterlesen...
     
  2. Hobi Expert
    Willkommen,

    Klicke die folgenden Schritte durch:
  3. Svetlana_Bu
    Svetlana_Bu Gast

    Hallo lliechte,



    Da dieses Problem von Software von Drittanbietern stammt, wenden Sie sich am besten an den Hersteller. Bitte stellen Sie sicher, dass die Software von der Website des Herstellers heruntergeladen wurden. Ich würde Ihnen auch empfehlen
    zu überprüfen, ob diese Version mit Windows 10 kompatibel ist.



    Lassen Sie uns wissen ob Sie noch irgendwelche Fragen haben.

    Mit freundlichen Grüßen,

    Svetlana
     
  4. Michael_Bo
    Michael_Bo Gast
    Moin,
    ein etwas speziellerer Dump *Augenzwinkern

    Schubst man den Debugger an, macht der auch was *Hallo!

    Irritierend: BUILD_VERSION_STRING: 10.0.16299.64
    obwohl Eingangs die 16299.15 benannt wird.
    da grübel ich auch noch ein wenig ob es sich um einen Fast-Ring Insider handelt?

    Jedenfalls hat der Fragesteller folgendes im Userbereich losgetreten:
    0 id: ce0 examine name: C:\Program Files (x86)\Spybot - Search & Destroy 2\SDFSSvc.exe

    Eine Anwendung in Delphi geschrieben und die knallt einfach

    Code:
    Code:
    30400000 305af000   SDFSSvc  SDFSSvc.exe  Fri Apr 25 14:12:04 2014 (535A5114)
    und zudem taufrisch aus der Mottenkiste *Breites Grinsen

    Anscheinend wurde von Spybot der Bitdefender Onlinescan losgetreten und hat sich dann in die Ecke gelegt,
    kannjamalpassieren.

    den Rest lasse ich mal unkommentiert hier so stehen @Ari45 es ist ein User Dump (mini)

    verborgener Text:
    Code:
    Code:
    start    end        module name  001d0000 001f0000   snlThirdParty150 snlThirdParty150.bpl Tue May 13 12:04:45 2014 (5371EE3D)  02570000 0259e000   snlFileFormats150 snlFileFormats150.bpl Tue May 13 12:04:46 2014 (5371EE3E)  029e0000 02ac1000   snlBase150 snlBase150.bpl Tue May 13 12:04:42 2014 (5371EE3A)  02ad0000 02b3b000   DEC150   DEC150.bpl   Tue May 13 12:04:40 2014 (5371EE38)  03800000 038b6000   SDFileScanLibrary SDFileScanLibrary.dll Fri Apr 25 14:11:56 2014 (535A510C)  03a40000 03a97000   SDLists  SDLists.dll  Fri Apr 25 14:11:45 2014 (535A5101)  03ef0000 03f8b000   SDLicense SDLicense.dll Fri Apr 25 14:11:37 2014 (535A50F9)  059d0000 05adb000   SDAdvancedCheckLibrary SDAdvancedCheckLibrary.dll Fri Apr 25 14:11:32 2014 (535A50F4)  30400000 305af000   SDFSSvc  SDFSSvc.exe  Fri Apr 25 14:12:04 2014 (535A5114)  48000000 4838f000   Jcl150   Jcl150.bpl   Tue May 13 12:04:39 2014 (5371EE37)  50030000 50248000   rtl150   rtl150.bpl   Fri Oct 29 02:21:51 2010 (4CCA139F)  50250000 504af000   vcl150   vcl150.bpl   Fri Oct 29 02:21:53 2010 (4CCA13A1)  60900000 6097a000   sqlite3  sqlite3.dll  Wed Apr 20 12:39:13 2011 (4DAEB7D1)  6c250000 6c257000   wship6   wship6.dll   77AC249C (This is a reproducible build file hash, not a timestamp)  6c260000 6c267000   WSHTCPIP WSHTCPIP.DLL DAA9D96B (This is a reproducible build file hash, not a timestamp)  6c270000 6c278000   wshqos   wshqos.dll   ED391F56 (This is a reproducible build file hash, not a timestamp)  6c410000 6c422000   ondemandconnroutehelper ondemandconnroutehelper.dll 2A282FE4 (This is a reproducible build file hash, not a timestamp)  6c520000 6c56e000   FWPUCLNT FWPUCLNT.DLL F2F1B4B9 (This is a reproducible build file hash, not a timestamp)  6c570000 6c578000   rasadhlp rasadhlp.dll 9B670EF5 (This is a reproducible build file hash, not a timestamp)  6c580000 6c588000   winnsi   winnsi.dll   BBCE397B (This is a reproducible build file hash, not a timestamp)  6c590000 6c5a4000   dhcpcsvc dhcpcsvc.dll 4991A422 (This is a reproducible build file hash, not a timestamp)  6ca80000 6caa6000   cryptnet cryptnet.dll AAFC9B45 (This is a reproducible build file hash, not a timestamp)  6cab0000 6cace000   gpapi    gpapi.dll    F7114C7E (This is a reproducible build file hash, not a timestamp)  6cd50000 6cd95000   winsta   winsta.dll   BFF62567 (This is a reproducible build file hash, not a timestamp)  6cda0000 6cdbc000   srvcli   srvcli.dll   B6F87291 (This is a reproducible build file hash, not a timestamp)  6d3b0000 6d3c3000   dhcpcsvc6 dhcpcsvc6.DLL 4192451E (This is a reproducible build file hash, not a timestamp)  6d3d0000 6d3dc000   winrnr   winrnr.dll   0F60441B (This is a reproducible build file hash, not a timestamp)  6d3e0000 6d474000   dnsapi   dnsapi.dll   33439F68 (This is a reproducible build file hash, not a timestamp)  6d480000 6d493000   nlaapi   nlaapi.dll   59B8F036 (This is a reproducible build file hash, not a timestamp)  6d4a0000 6d4b6000   pnrpnsp  pnrpnsp.dll  F03ACE1A (This is a reproducible build file hash, not a timestamp)  6d4c0000 6d6d9000   iertutil iertutil.dll 470CA0FF (This is a reproducible build file hash, not a timestamp)  6d6e0000 6d6f1000   NapiNSP  NapiNSP.dll  386B5E89 (This is a reproducible build file hash, not a timestamp)  6d890000 6d90f000   scan     scan.dll     Mon Dec 15 16:04:19 2014 (548EF873)  6d910000 6d965000   mswsock  mswsock.dll  8B60D45F (This is a reproducible build file hash, not a timestamp)  6ec80000 6ec90000   wkscli   wkscli.dll   6FE4C5E3 (This is a reproducible build file hash, not a timestamp)  6ec90000 6eca0000   jsproxy  jsproxy.dll  B94CDFD6 (This is a reproducible build file hash, not a timestamp)  6f450000 6f4fd000   winhttp  winhttp.dll  B97927AD (This is a reproducible build file hash, not a timestamp)  6ff00000 6ff2f000   rsaenh   rsaenh.dll   53DD945D (This is a reproducible build file hash, not a timestamp)  6ff30000 6ff43000   cryptsp  cryptsp.dll  8D3CA744 (This is a reproducible build file hash, not a timestamp)  70e00000 70e0b000   netutils netutils.dll B7E8BCE9 (This is a reproducible build file hash, not a timestamp)  70e10000 70e25000   samcli   samcli.dll   90805859 (This is a reproducible build file hash, not a timestamp)  71900000 71923000   WINMMBASE WINMMBASE.dll C565DEBA (This is a reproducible build file hash, not a timestamp)  71930000 71949000   bcrypt   bcrypt.dll   A3EC05D9 (This is a reproducible build file hash, not a timestamp)  71950000 71976000   oledlg   oledlg.dll   A6764358 (This is a reproducible build file hash, not a timestamp)  71980000 719ec000   winspool winspool.drv 5614917D (This is a reproducible build file hash, not a timestamp)  719f0000 719f6000   msimg32  msimg32.dll  D925D9C7 (This is a reproducible build file hash, not a timestamp)  71a00000 71a56000   oleacc   oleacc.dll   835BFEEF (This is a reproducible build file hash, not a timestamp)  71a60000 71a66000   shfolder shfolder.dll FCC003E6 (This is a reproducible build file hash, not a timestamp)  71a70000 71a7f000   wtsapi32 wtsapi32.dll 2A6574F9 (This is a reproducible build file hash, not a timestamp)  71a80000 71a97000   mpr      mpr.dll      A65A043D (This is a reproducible build file hash, not a timestamp)  71aa0000 71ab3000   netapi32 netapi32.dll 25CD61C0 (This is a reproducible build file hash, not a timestamp)  71ac0000 71ae4000   winmm    winmm.dll    DCAF6B0F (This is a reproducible build file hash, not a timestamp)  71b10000 71b18000   wsock32  wsock32.dll  3E71643D (This is a reproducible build file hash, not a timestamp)  71b20000 71b50000   IPHLPAPI IPHLPAPI.DLL 815ABFE3 (This is a reproducible build file hash, not a timestamp)  71b50000 71e14000   wininet  wininet.dll  98D0D87D (This is a reproducible build file hash, not a timestamp)  71e20000 72031000   comctl32 comctl32.dll 5499FBCF (This is a reproducible build file hash, not a timestamp)  73a30000 73bb1000   dbghelp  dbghelp.dll  779682CE (This is a reproducible build file hash, not a timestamp)  73bc0000 73bc8000   version  version.dll  F3D25A4A (This is a reproducible build file hash, not a timestamp)  73c80000 73ca4000   dbgcore  dbgcore.dll  F4557D1A (This is a reproducible build file hash, not a timestamp)  73cb0000 73cba000   CRYPTBASE CRYPTBASE.dll 19CF9F33 (This is a reproducible build file hash, not a timestamp)  73cc0000 73ce0000   sspicli  sspicli.dll  72659DCB (This is a reproducible build file hash, not a timestamp)  73ce0000 73e55000   user32   user32.dll   2CCB7FF7 (This is a reproducible build file hash, not a timestamp)  73e60000 74037000   KERNELBASE KERNELBASE.dll 2CD1CE3D (This is a reproducible build file hash, not a timestamp)  74040000 741c2000   crypt32  crypt32.dll  EDB6BEDA (This is a reproducible build file hash, not a timestamp)  741d0000 742a0000   kernel32 kernel32.dll 744765CE (This is a reproducible build file hash, not a timestamp)  74820000 75b53000   shell32  shell32.dll  DE73B2AD (This is a reproducible build file hash, not a timestamp)  75bf0000 75cc4000   comdlg32 comdlg32.dll 72D569B9 (This is a reproducible build file hash, not a timestamp)  75ce0000 75d18000   cfgmgr32 cfgmgr32.dll 80FC57D1 (This is a reproducible build file hash, not a timestamp)  75d20000 75d63000   sechost  sechost.dll  C2E7C9DE (This is a reproducible build file hash, not a timestamp)  75d70000 75e67000   ole32    ole32.dll    0774F0C4 (This is a reproducible build file hash, not a timestamp)  75e70000 75eb6000   wintrust wintrust.dll 22DC3210 (This is a reproducible build file hash, not a timestamp)  75ec0000 75f17000   bcryptPrimitives bcryptPrimitives.dll C4AC6C6D (This is a reproducible build file hash, not a timestamp)  75f20000 764e6000   windows_storage windows.storage.dll 952ABBDE (This is a reproducible build file hash, not a timestamp)  764f0000 76578000   SHCore   SHCore.dll   30134C68 (This is a reproducible build file hash, not a timestamp)  76580000 765fc000   msvcp_win msvcp_win.dll F753CD86 (This is a reproducible build file hash, not a timestamp)  76770000 76789000   imagehlp imagehlp.dll 575625F6 (This is a reproducible build file hash, not a timestamp)  76790000 767b2000   gdi32    gdi32.dll    BF7B6630 (This is a reproducible build file hash, not a timestamp)  76850000 769af000   gdi32full gdi32full.dll B10ACF2B (This is a reproducible build file hash, not a timestamp)  769b0000 76a28000   advapi32 advapi32.dll 90205C2C (This is a reproducible build file hash, not a timestamp)  76a30000 76a3e000   kernel_appcore kernel.appcore.dll 6ED3F6D7 (This is a reproducible build file hash, not a timestamp)  76a40000 76b57000   ucrtbase ucrtbase.dll 9E3394C7 (This is a reproducible build file hash, not a timestamp)  76bc0000 76c05000   powrprof powrprof.dll 22B78047 (This is a reproducible build file hash, not a timestamp)  76c10000 76ccd000   msvcrt   msvcrt.dll   692918B7 (This is a reproducible build file hash, not a timestamp)  76cd0000 76cf5000   imm32    imm32.dll    5693230D (This is a reproducible build file hash, not a timestamp)  76d00000 76d45000   shlwapi  shlwapi.dll  B84CAA87 (This is a reproducible build file hash, not a timestamp)  76d50000 76db6000   ws2_32   ws2_32.dll   EFE92F55 (This is a reproducible build file hash, not a timestamp)  76dc0000 76dc6000   psapi    psapi.dll    D846A03B (This is a reproducible build file hash, not a timestamp)  76dd0000 76dd7000   nsi      nsi.dll      84B7BBBD (This is a reproducible build file hash, not a timestamp)  76de0000 76df4000   profapi  profapi.dll  6BA8AA8C (This is a reproducible build file hash, not a timestamp)  76ec0000 76f7e000   rpcrt4   rpcrt4.dll   6E4FB734 (This is a reproducible build file hash, not a timestamp)  76f80000 76f8e000   msasn1   msasn1.dll   2BEB14E2 (This is a reproducible build file hash, not a timestamp)  76f90000 76fa6000   win32u   win32u.dll   D6F8A085 (This is a reproducible build file hash, not a timestamp)  76fb0000 77043000   oleaut32 oleaut32.dll A2F491B8 (This is a reproducible build file hash, not a timestamp)  77050000 77296000   combase  combase.dll  811A4962 (This is a reproducible build file hash, not a timestamp)  772a0000 7742d000   ntdll    ntdll.dll    AC8AFC81 (This is a reproducible build file hash, not a timestamp)  0:000> !analyze -v  *******************************************************************************  *                                                                             *  *                        Exception Analysis                                   *  *                                                                             *  *******************************************************************************    GetUrlPageData2 (WinHttp) failed: 12002.    DUMP_CLASS: 2    DUMP_QUALIFIER: 400    CONTEXT:  (.ecxr)  eax=00000014 ebx=00000000 ecx=00000000 edx=00000020 esi=000000dc edi=000032f0  eip=00000007 esp=00000001 ebp=00000001 iopl=0         nv up di pl zr ac pe nc  cs=0034  ss=0000  ds=0001  es=0020  fs=6341  gs=0000             efl=0000017c  0034:00000007 ??              ???  Resetting default scope    FAULTING_IP:   KERNELBASE!RaiseException+62  73f608b2 8b4c2454        mov     ecx,dword ptr [esp+54h]    EXCEPTION_RECORD:  (.exr -1)  ExceptionAddress: 73f608b2 (KERNELBASE!RaiseException+0x00000062)     ExceptionCode: 0eedfade    ExceptionFlags: 00000001  NumberParameters: 7     Parameter[0]: 500ada8d     Parameter[1]: 030f2b60     Parameter[2]: 0019ff01     Parameter[3]: 039c3ca0     Parameter[4]: 00000001     Parameter[5]: 00000002     Parameter[6]: 0019ff1c    PROCESS_NAME:  SDFSSvc.exe    ERROR_CODE: (NTSTATUS) 0xeedfade - <Unable to get error code text>    EXCEPTION_CODE: (Win32) 0xeedfade (250477278) - <Unable to get error code text>    EXCEPTION_CODE_STR:  eedfade    EXCEPTION_PARAMETER1:  500ada8d    EXCEPTION_PARAMETER2:  030f2b60    EXCEPTION_PARAMETER3:  0019ff01    EXCEPTION_PARAMETER4: 39c3ca0    WATSON_BKT_PROCSTAMP:  5371ee3d    WATSON_BKT_PROCVER:  1.0.0.0    WATSON_BKT_MODULE:  KERNELBASE.dll    WATSON_BKT_MODSTAMP:  2cd1ce3d    WATSON_BKT_MODOFFSET:  1008b2    WATSON_BKT_MODVER:  10.0.16299.15    MODULE_VER_PRODUCT:  Microsoft® Windows® Operating System    BUILD_VERSION_STRING:  10.0.16299.64 (WinBuild.160101.0800)    MODLIST_WITH_TSCHKSUM_HASH:  3bef3c1d277deeacb0bb47daf75d854d214e3f06    MODLIST_SHA1_HASH:  f5bbf19011c48f45d6cbebdb469f07af8b1ae315    TIMELINE_TIMES: 4    Timeline: Process      Name: !analyze      Time: 2017-11-13T12:00:31Z      Diff: 1791        Name: Origin      Time: 2017-11-13T11:30:40Z      Diff: 0        Name: SystemStart      Time: 2017-11-13T11:30:40Z      Diff: 0        Name: ProcessStart      Time: 2017-11-13T11:28:43Z      Diff: 117      DUMP_FLAGS:  0    DUMP_TYPE:  2    ANALYSIS_SESSION_HOST:  SKYLAKE1    ANALYSIS_SESSION_TIME:  11-13-2017 13:00:31.0644    ANALYSIS_VERSION: 10.0.17016.1000 x86fre    THREAD_ATTRIBUTES:   LAST_CONTROL_TRANSFER:  from 00000000 to 00000007    FAULTING_THREAD:  00000ce4    PROBLEM_CLASSES:         ID:     [0n315]      Type:   [@APPLICATION_FAULT_STRING]      Class:  Primary      Scope:  DEFAULT_BUCKET_ID (Failure Bucket ID prefix)              BUCKET_ID      Name:   Omit      Data:   Add              String: [DELPHI_EXCEPTION]      PID:    [Unspecified]      TID:    [Unspecified]      Frame:  [0]    BUGCHECK_STR:  DELPHI_EXCEPTION    UNALIGNED_STACK_POINTER:  00000001    STACK_TEXT:    00000000 00000000 SDFSSvc.exe!unknown_error_in_process+0x0  00000000 00000000 unknown![.ecxr]+0x0  00000001 00000007 unknown!unknown+0x0      THREAD_SHA1_HASH_MOD_FUNC:  e2439d390b568c3e0d58d31e205dafdf49b9f5ce    THREAD_SHA1_HASH_MOD_FUNC_OFFSET:  d84fbcc675a88995ab04c74af8a9870b603bbd67    THREAD_SHA1_HASH_MOD:  a94e177c73ecbdb35cfbaf21eb11cffdf06a072b    SYMBOL_STACK_INDEX:  0    SYMBOL_NAME:  SDFSSvc.exe!unknown_error_in_process    FOLLOWUP_NAME:  MachineOwner    MODULE_NAME: SDFSSvc    IMAGE_NAME:  SDFSSvc.exe    DEBUG_FLR_IMAGE_TIMESTAMP:  535a5114    STACK_COMMAND:  .ecxr ; kb ; ** Pseudo Context ** Pseudo ** Value: 8618970 ** ; kb    BUCKET_ID:  ZEROED_STACK_DELPHI_EXCEPTION    DEFAULT_BUCKET_ID:  ZEROED_STACK_DELPHI_EXCEPTION    PRIMARY_PROBLEM_CLASS:  ZEROED_STACK_DELPHI_EXCEPTION    FAILURE_EXCEPTION_CODE:  eedfade    FAILURE_IMAGE_NAME:  SDFSSvc.exe    BUCKET_ID_IMAGE_STR:  SDFSSvc.exe    FAILURE_MODULE_NAME:  SDFSSvc    BUCKET_ID_MODULE_STR:  SDFSSvc    FAILURE_FUNCTION_NAME:  unknown_error_in_process    BUCKET_ID_FUNCTION_STR:  unknown_error_in_process    BUCKET_ID_OFFSET:  0    BUCKET_ID_MODTIMEDATESTAMP:  535a5114    BUCKET_ID_MODCHECKSUM:  1b28c6    BUCKET_ID_MODVER_STR:  2.6.46.217    BUCKET_ID_PREFIX_STR:  ZEROED_STACK_DELPHI_EXCEPTION    FAILURE_PROBLEM_CLASS:  ZEROED_STACK_DELPHI_EXCEPTION    FAILURE_SYMBOL_NAME:  SDFSSvc.exe!unknown_error_in_process    FAILURE_BUCKET_ID:  ZEROED_STACK_DELPHI_EXCEPTION_eedfade_SDFSSvc.exe!unknown_error_in_process    WATSON_STAGEONE_URL:  http://watson.microsoft.com/StageOne/SDFSSvc.exe/1.0.0.0/5371ee3d/KERNELBASE.dll/10.0.16299.15/2cd1ce3d/eedfade/001008b2.htm?Retriage=1    TARGET_TIME:  2017-11-13T11:30:40.000Z    OSBUILD:  16299    OSSERVICEPACK:  15    SERVICEPACK_NUMBER: 0    OS_REVISION: 0    SUITE_MASK:  768    PRODUCT_TYPE:  1    OSPLATFORM_TYPE:  x86    OSNAME:  Windows 10    OSEDITION:  Windows 10 WinNt SingleUserTS Personal    OS_LOCALE:      USER_LCID:  0    OSBUILD_TIMESTAMP:  2031-10-27 03:56:14    BUILDDATESTAMP_STR:  160101.0800    BUILDLAB_STR:  WinBuild    BUILDOSVER_STR:  10.0.16299.64    ANALYSIS_SESSION_ELAPSED_TIME:  5602    ANALYSIS_SOURCE:  UM    FAILURE_ID_HASH_STRING:  um:zeroed_stack_delphi_exception_eedfade_sdfssvc.exe!unknown_error_in_process    FAILURE_ID_HASH:  {77c99370-35a9-1ed0-cdee-4e590498b387}    Followup:     MachineOwner  ---------
     
Thema:

bcrypt.dll

Die Seite wird geladen...

bcrypt.dll - Ähnliche Themen - bcrypt dll

Forum Datum

Seit kurzem bekomme ich die Meldung " VCRUNTIME140_1.dll fehlt " wie kann ich diesen...

Seit kurzem bekomme ich die Meldung " VCRUNTIME140_1.dll fehlt " wie kann ich diesen...: Ich habe seit heute das Problem VCRUNTIME140_1.dll fehlt wenn ich Bambustudio ausführen möchte . Eine Neuinstalation des Programmes hat nicht geholfen ? wie muss ich vorgehen ? Weiterlesen...

Windows 10 Support 16. Januar 2024

Fehler im Modul vcruntim140.dll

Fehler im Modul vcruntim140.dll: Hallo, ich habe folgendes Problem:Ich möchte mit dem Programm Magix Video Deluxe 2022 ein Video als *.mp4-Datei ausgeben und erhalte einen Fehler im Modul vcruntime140.dll.Den nachfolgend aufgeführten Lösungen kann ich entnehmen, dass ich diese Dateien neu installieren soll. Hierzu meine...

Windows 10 Support 5. Januar 2024

Probleme mit Berechtigung und VCRUNTIME140.dll?

Probleme mit Berechtigung und VCRUNTIME140.dll?: Ich musste vor 2 Wochen ungefähr meinen PC auf null zurücksetzen. Leider sind dadurch viele Probleme entstanden. Ich jetzt einige Programmen und Spiele nicht mehr öffnen.. Mir fehlen msvcp140.dll und dann wieder VCRUNTIME140.dll . Ich habe msvcp140.dll erfolgreich neu installieren können, aber...

Windows 10 Support 12. November 2023

Windows 10: DLL Fehlermeldung

Windows 10: DLL Fehlermeldung: Nach einem Absturz kommt bei dem Versuch div. Programme zu öffnen, folgende Fehlermeldung:Verschiedene Reparaturversuche Neu Installation der betroffenen Programme, Systemwiederherstellung, chkdsk, Fortect, usw. waren bisher nicht erfolgreich.Wäre schön hier eine bei mir funktionierende Lösung...

Windows 10 Support 12. November 2023

Registrierung einer DLL-Datei MSSTFDMT.DLL

Registrierung einer DLL-Datei MSSTFDMT.DLL: Guten AbendIch habe ein Problem mit der Registrierung einer DLL-Datei msstdfmt.dll. Siehe beigelegten Screenshot. Nun erkläre ich Ihnen den Grund meiner Frage:Grund meiner Frage:Ich hatte damals eine Software Visual Basic 6.0 entwickelt. Diese Software wurde erfolgreich kompiliert und läuft...

Windows 10 Support 19. Oktober 2023

vcruntime140_1.dll aber im System32 Ordner

vcruntime140_1.dll aber im System32 Ordner: Moin,ich habe das Problem, dass sich eine Anwendung nicht korrekt starten lässt, da immer dieser Fehler auftaucht.Deswegen hatte ich das Problem einmal gesucht und bin im Ansatz fündig geworden. Nur ist jetzt das Problem, dass die Beispiele immer in einem Gamefolder waren, aber nie im System32...

Windows 10 Support 17. Oktober 2023

LoadLibrary failed with Error 1114: Eine DLL-Initialisierungsroutine ist fehlgeschlagen

LoadLibrary failed with Error 1114: Eine DLL-Initialisierungsroutine ist fehlgeschlagen: Hallo alle zusammen,vor ca. 1 1/2 Monaten ist mein Laptop defekt gegangen. Ich habe die alte HDD herausgenommen und eine neue 1TB SSD von Intenso verbaut. Windows neu installiert, alles hat einwandfrei funktioniert. Ich wollte mir mein Schneideprogramm Vegas Pro neu herunterladen, da ich es...

Windows 10 Support 24. September 2023

Fehlerhafte DLL, kann Programme nicht öffen

Fehlerhafte DLL, kann Programme nicht öffen: Abend, ich habe folgendes Problem:Ich habe heute einen neuen PC bekommen, von Windows 8 auf 10 geupdatet und angefangenSpiele runterzuladen. Bei einem Spiel was ich auf Steam runtergeladen habe, kommt folgende Fehlermeldung Anhang. Ich habe schon versucht das Spiel neu runterzuladen,...

Windows 10 Support 30. Juli 2023

bcrypt.dll [gelöst]

Schlagworte:

Andere User suchten nach Lösungen mit:

  1. bcrypt.dll ist entweder nicht für die ausführung

    ,
  2. failed on C:\Windows\System32\bcrypt.dll

    ,
  3. itunes bcrypt.dll nicht gefunden

    ,
  4. bcrypt.dll,
  5. bcrypr.dll windows
  1. Diese Seite verwendet Cookies. Wenn du dich weiterhin auf dieser Seite aufhältst, akzeptierst du unseren Einsatz von Cookies.
    Auf dieser Website werden Cookies für die Zugriffsanalyse und Anzeigenmessung verwendet.
    Information ausblenden